Reaction Details
TargetcGMP-dependent 3',5'-cyclic phosphodiesterase
LigandBDBM320670
Substrate/Competitorn/a
Meas. Tech.Lab B PDE2 assay
Ki 0.110±n/a nM
Citation Shen, DDwyer, MPSinz, CJWang, DStachel, SJPaone, DVForster, ABerger, RChen, YQian, YXu, SHu, C Dihydropyrazolopyrimidinone compounds as PDE2 inhibitors US Patent US10174037 Publication Date 1/8/2019
 
cGMP-dependent 3',5'-cyclic phosphodiesterase
Name:cGMP-dependent 3',5'-cyclic phosphodiesterase
Type:Enzyme Catalytic Domain
Mol. Mass.:105691.58
Organism:Homo sapiens (Human)
Description:O00408
Residue:941
BDBM320670
NameBDBM320670
Synonyms:(R)- or (S)-6-(Dimethylamino)-3- (hydroxymethyl)-1-(1-(4- isopropylphenyl)-2-methylpropyl)- 1H-pyrazolo[3,4-d]pyrimidin-4(5H)- one US10174037, Example 79
TypeSmall organic molecule
Emp. Form.C21H29N5O2
Mol. Mass.383.4873
SMILESCC(C)C(c1ccc(cc1)C(C)C)n1nc(CO)c2c1nc([nH]c2=O)N(C)C