Reaction Details
TargetcGMP-dependent 3',5'-cyclic phosphodiesterase
LigandBDBM320726
Substrate/Competitorn/a
Meas. Tech.Lab B PDE2 assay
Ki 0.040±n/a nM
Citation Shen, DDwyer, MPSinz, CJWang, DStachel, SJPaone, DVForster, ABerger, RChen, YQian, YXu, SHu, C Dihydropyrazolopyrimidinone compounds as PDE2 inhibitors US Patent US10174037 Publication Date 1/8/2019
 
cGMP-dependent 3',5'-cyclic phosphodiesterase
Name:cGMP-dependent 3',5'-cyclic phosphodiesterase
Type:Enzyme Catalytic Domain
Mol. Mass.:105691.58
Organism:Homo sapiens (Human)
Description:O00408
Residue:941
BDBM320726
NameBDBM320726
Synonyms:(R)- or (S)-6-(Dimethylamino)- 1-(1-(2-fluoro-4- (trifluoromethyl)phenyl)-2- methylpropyl)-3- (hydroxymethyl)-1H- pyrazolo[3,4-d]pyrimidin- 4(5H)-one US10174037, Example 133
TypeSmall organic molecule
Emp. Form.C19H21F4N5O2
Mol. Mass.427.396
SMILESCC(C)C(c1ccc(cc1F)C(F)(F)F)n1nc(CO)c2c1nc([nH]c2=O)N(C)C