Reaction Details
TargetPhosphodiesterase
LigandBDBM320728
Substrate/Competitorn/a
Meas. Tech.Lab B PDE2 assay
Ki 0.050±n/a nM
Citation Shen, DDwyer, MPSinz, CJWang, DStachel, SJPaone, DVForster, ABerger, RChen, YQian, YXu, SHu, C Dihydropyrazolopyrimidinone compounds as PDE2 inhibitors US Patent US10174037 Publication Date 1/8/2019
 
Phosphodiesterase
Name:Phosphodiesterase
Synonyms:PDE2A
Type:Enzyme Catalytic Domain
Mol. Mass.:105104.20
Organism:Macaca mulatta (Rhesus macaque)
Description:n/a
Residue:935
BDBM320728
NameBDBM320728
TypeSmall organic molecule
Emp. Form.C19H19F4N5O2
Mol. Mass.425.3801
SMILESCN(C)c1nc2n(nc(CO)c2c(=O)[nH]1)C(C1CC1)c1ccc(cc1F)C(F)(F)F