Reaction Details
TargetPhosphodiesterase
LigandBDBM320710
Substrate/Competitorn/a
Meas. Tech.Lab B PDE2 assay
Ki 0.290±n/a nM
Citation Shen, DDwyer, MPSinz, CJWang, DStachel, SJPaone, DVForster, ABerger, RChen, YQian, YXu, SHu, C Dihydropyrazolopyrimidinone compounds as PDE2 inhibitors US Patent US10174037 Publication Date 1/8/2019
 
Phosphodiesterase
Name:Phosphodiesterase
Synonyms:PDE2A
Type:Enzyme Catalytic Domain
Mol. Mass.:105104.20
Organism:Macaca mulatta (Rhesus macaque)
Description:n/a
Residue:935
BDBM320710
NameBDBM320710
TypeSmall organic molecule
Emp. Form.C19H21F4N5O2
Mol. Mass.427.396
SMILESCC(C)C(c1ccc(c(F)c1)C(F)(F)F)n1nc(CO)c2c1nc([nH]c2=O)N(C)C