Reaction Details
TargetPhosphodiesterase
LigandBDBM320770
Substrate/Competitorn/a
Meas. Tech.Lab B PDE2 assay
Ki 0.058±n/a nM
Citation Shen, DDwyer, MPSinz, CJWang, DStachel, SJPaone, DVForster, ABerger, RChen, YQian, YXu, SHu, C Dihydropyrazolopyrimidinone compounds as PDE2 inhibitors US Patent US10174037 Publication Date 1/8/2019
 
Phosphodiesterase
Name:Phosphodiesterase
Synonyms:PDE2A
Type:Enzyme Catalytic Domain
Mol. Mass.:105104.20
Organism:Macaca mulatta (Rhesus macaque)
Description:n/a
Residue:935
BDBM320770
NameBDBM320770
TypeSmall organic molecule
Emp. Form.C21H28FN5O
Mol. Mass.385.4783
SMILESCC(C)C(c1ccc(cc1)C(C)C)n1nc(CF)c2c1nc([nH]c2=O)N(C)C