Reaction Details
TargetcGMP-dependent 3',5'-cyclic phosphodiesterase
LigandBDBM320778
Substrate/Competitorn/a
Meas. Tech.Lab B PDE2 assay
Ki 0.120±n/a nM
Citation Shen, DDwyer, MPSinz, CJWang, DStachel, SJPaone, DVForster, ABerger, RChen, YQian, YXu, SHu, C Dihydropyrazolopyrimidinone compounds as PDE2 inhibitors US Patent US10174037 Publication Date 1/8/2019
 
cGMP-dependent 3',5'-cyclic phosphodiesterase
Name:cGMP-dependent 3',5'-cyclic phosphodiesterase
Type:Enzyme Catalytic Domain
Mol. Mass.:105691.58
Organism:Homo sapiens (Human)
Description:O00408
Residue:941
BDBM320778
NameBDBM320778
Synonyms:(R)- or (S)-1-(1-(4- (Difluoromethoxy)phenyl)-2- methylpropyl)-6-(dimethylamino)-3- (fluoromethyl)-1H-pyrazolo[3,4- d]pyrimidin-4(5H)-one US10174037, Example 185
TypeSmall organic molecule
Emp. Form.C19H22F3N5O2
Mol. Mass.409.4055
SMILESCC(C)C(c1ccc(OC(F)F)cc1)n1nc(CF)c2c1nc([nH]c2=O)N(C)C