Reaction Details
TargetAP2-associated protein kinase 1
LigandBDBM321107
Substrate/Competitorn/a
Meas. Tech.AAK1 Kinase Assay
IC50 0.620±n/a nM
Citation Nara, SJDzierba, CDMacor, JEBronson, JJRamkumar, RMaishal, TKKaratholuvhu, MSThangavel, SThiyagarajan, K Fused pyridines as kinase inhibitors US Patent US10174044 Publication Date 1/8/2019
 
AP2-associated protein kinase 1
Name:AP2-associated protein kinase 1
Type:PROTEIN
Mol. Mass.:103884.23
Organism:Homo sapiens (Human)
Description:ChEMBL_774569
Residue:961
BDBM321107
NameBDBM321107
Synonyms:(S)-ethyl (8-((2-amino-2,4-dimethylpentyl)oxy)-6H-isochromeno[3,4-c]pyridin-2-yl)carbamate | US10174044, Example 41
TypeSmall organic molecule
Emp. Form.C22H29N3O4
Mol. Mass.399.4834
SMILESCCOC(=O)Nc1cc-2c(OCc3cc(OC[C@@](C)(N)CC(C)C)ccc-23)cn1