Reaction Details
TargetSodium-dependent serotonin transporter
LigandBDBM322072
Substrate/Competitorn/a
Meas. Tech.h-SERT Binding Assay
Ki 1.50±n/a nM
Citation Sasaki, IToyoda, TYoshinaga, HNatsutani, ITakahashi, Y Pyrazole compound US Patent US10183913 Publication Date 1/22/2019
 
Sodium-dependent serotonin transporter
Name:Sodium-dependent serotonin transporter
Type:Multi-pass membrane protein
Mol. Mass.:70322.51
Organism:Homo sapiens (Human)
Description:P31645
Residue:630
BDBM322072
NameBDBM322072
Synonyms:1-[5-(benzyloxy)-1-(cyclohexylmethyl)-1H-pyrazol-3-yl]-N-methylmethanamine US11312688, Example 5 | US11576897, Example 5
TypeSmall organic molecule
Emp. Form.C19H27N3O
Mol. Mass.313.4372
SMILESCNCc1cc(OCc2ccccc2)n(CC2CCCCC2)n1