Reaction Details
Target5-hydroxytryptamine receptor 2C
LigandBDBM322073
Substrate/Competitorn/a
Meas. Tech.5-HT2C Receptor Binding Assay
Ki 5.20±n/a nM
Citation Sasaki, IToyoda, TYoshinaga, HNatsutani, ITakahashi, Y Pyrazole compound US Patent US10183913 Publication Date 1/22/2019
 
5-hydroxytryptamine receptor 2C
Name:5-hydroxytryptamine receptor 2C
Type:G Protein-Coupled Receptor (GPCR)
Mol. Mass.:51836.79
Organism:Homo sapiens (Human)
Description:P28335
Residue:458
BDBM322073
NameBDBM322073
Synonyms:1-{1-(cyclohexylmethyl)-5-[(4-fluoro-2-methylbenzyl)-oxy]-1H-pyrazol-3-yl}-N-methylmethanamine US11312688, Example 31 | US11576897, Example 31
TypeSmall organic molecule
Emp. Form.C20H28FN3O
Mol. Mass.345.4542
SMILESCNCc1cc(OCc2ccc(F)cc2C)n(CC2CCCCC2)n1