Reaction Details
Target5-hydroxytryptamine receptor 2C
LigandBDBM322076
Substrate/Competitorn/a
Meas. Tech.5-HT2C Receptor Binding Assay
Ki 18.0±n/a nM
Citation Sasaki, IToyoda, TYoshinaga, HNatsutani, ITakahashi, Y Pyrazole compound US Patent US10183913 Publication Date 1/22/2019
 
5-hydroxytryptamine receptor 2C
Name:5-hydroxytryptamine receptor 2C
Type:G Protein-Coupled Receptor (GPCR)
Mol. Mass.:51836.79
Organism:Homo sapiens (Human)
Description:P28335
Residue:458
BDBM322076
NameBDBM322076
Synonyms:US10183913, Example 108 US11576897, Example 108
TypeSmall organic molecule
Emp. Form.C19H26FN3O2
Mol. Mass.347.427
SMILESCNCc1cc(OCc2ccc(F)cc2C)n(CC2CCCCO2)n1