Reaction Details
TargetSodium-dependent serotonin transporter
LigandBDBM322078
Substrate/Competitorn/a
Meas. Tech.h-SERT Binding Assay
Ki 8.10±n/a nM
Citation Sasaki, IToyoda, TYoshinaga, HNatsutani, ITakahashi, Y Pyrazole compound US Patent US10183913 Publication Date 1/22/2019
 
Sodium-dependent serotonin transporter
Name:Sodium-dependent serotonin transporter
Type:Multi-pass membrane protein
Mol. Mass.:70322.51
Organism:Homo sapiens (Human)
Description:P31645
Residue:630
BDBM322078
NameBDBM322078
Synonyms:US10183913, Example 122 | US11312688, Example 122
TypeSmall organic molecule
Emp. Form.C19H24ClN3O2
Mol. Mass.361.866
SMILESCNCc1cc(OCc2cccc(Cl)c2)n(CC2OC3CCC2C3)n1