Reaction Details
Target5-hydroxytryptamine receptor 2C
LigandBDBM322099
Substrate/Competitorn/a
Meas. Tech.5-HT2C Receptor Binding Assay
Ki 9.70±n/a nM
Citation Sasaki, IToyoda, TYoshinaga, HNatsutani, ITakahashi, Y Pyrazole compound US Patent US10183913 Publication Date 1/22/2019
 
5-hydroxytryptamine receptor 2C
Name:5-hydroxytryptamine receptor 2C
Type:G Protein-Coupled Receptor (GPCR)
Mol. Mass.:51836.79
Organism:Homo sapiens (Human)
Description:P28335
Residue:458
BDBM322099
NameBDBM322099
Synonyms:1-{1-(cyclopentylmethyl)-5-[(2,4,5-trifluorobenzyl)-oxy]-1H-pyrazol-3-yl}-N-methylmethanamine US11312688, Example 280 | US11576897, Example 280
TypeSmall organic molecule
Emp. Form.C18H22F3N3O
Mol. Mass.353.382
SMILESCNCc1cc(OCc2cc(F)c(F)cc2F)n(CC2CCCC2)n1