Reaction Details
Target5-hydroxytryptamine receptor 2C
LigandBDBM322109
Substrate/Competitorn/a
Meas. Tech.5-HT2C Receptor Binding Assay
Ki 14.0±n/a nM
Citation Sasaki, IToyoda, TYoshinaga, HNatsutani, ITakahashi, Y Pyrazole compound US Patent US10183913 Publication Date 1/22/2019
 
5-hydroxytryptamine receptor 2C
Name:5-hydroxytryptamine receptor 2C
Type:G Protein-Coupled Receptor (GPCR)
Mol. Mass.:51836.79
Organism:Homo sapiens (Human)
Description:P28335
Residue:458
BDBM322109
NameBDBM322109
Synonyms:N-({1-(Cyclohexylmethyl)-5-[(2,5-difluorobenzyl)oxy]-1H-pyrazol-3-yl}methyl)cyclopropanamine US11312688, Example 342 | US11576897, Example 342
TypeSmall organic molecule
Emp. Form.C21H27F2N3O
Mol. Mass.375.4554
SMILESFc1ccc(F)c(COc2cc(CNC3CC3)nn2CC2CCCCC2)c1