Reaction Details
Target5-hydroxytryptamine receptor 2C
LigandBDBM322118
Substrate/Competitorn/a
Meas. Tech.5-HT2C Receptor Binding Assay
Ki 5.30±n/a nM
Citation Sasaki, IToyoda, TYoshinaga, HNatsutani, ITakahashi, Y Pyrazole compound US Patent US10183913 Publication Date 1/22/2019
 
5-hydroxytryptamine receptor 2C
Name:5-hydroxytryptamine receptor 2C
Type:G Protein-Coupled Receptor (GPCR)
Mol. Mass.:51836.79
Organism:Homo sapiens (Human)
Description:P28335
Residue:458
BDBM322118
NameBDBM322118
Synonyms:US10183913, Example 400
TypeSmall organic molecule
Emp. Form.C20H30FN3O
Mol. Mass.347.4701
SMILESCCC(CC)CCn1nc(CNC)cc1OCc1cc(C)ccc1F