Reaction Details
Target5-hydroxytryptamine receptor 2C
LigandBDBM322125
Substrate/Competitorn/a
Meas. Tech.5-HT2C Receptor Binding Assay
Ki 13.0±n/a nM
Citation Sasaki, IToyoda, TYoshinaga, HNatsutani, ITakahashi, Y Pyrazole compound US Patent US10183913 Publication Date 1/22/2019
 
5-hydroxytryptamine receptor 2C
Name:5-hydroxytryptamine receptor 2C
Type:G Protein-Coupled Receptor (GPCR)
Mol. Mass.:51836.79
Organism:Homo sapiens (Human)
Description:P28335
Residue:458
BDBM322125
NameBDBM322125
Synonyms:1-(5-[(2,5-difluorobenzyl)oxy]-1-{[1-(trifluoro-methyl)cyclopentyl]methyl}-1H-pyrazol-3-yl)-N-methylmethanamine US11312688, Example 447
TypeSmall organic molecule
Emp. Form.C19H22F5N3O
Mol. Mass.403.3895
SMILESCNCc1cc(OCc2cc(F)ccc2F)n(CC2(CCCC2)C(F)(F)F)n1