Reaction Details
TargetP2X purinoceptor 3
LigandBDBM319839
Substrate/Competitorn/a
Meas. Tech.Intracellular Calcium Measurement to Assess Antagonist Activity at Human P2X3 and Human P2X2/3 Receptors
IC50 4.00±n/a nM
Citation Davenport, AJBräuer, NFischer, OMRotgeri, ARottmann, ANeagoe, INagel, JGodinho-Coelho, AKlar, J 1,3-thiazol-2-yl substituted benzamides US Patent US10183937 Publication Date 1/22/2019
 
P2X purinoceptor 3
Name:P2X purinoceptor 3
Type:Protein
Mol. Mass.:44292.02
Organism:Homo sapiens (Human)
Description:P56373
Residue:397
BDBM319839
NameBDBM319839
Synonyms:N-[1-(5-Chloro-3-fluoropyridin-2-yl)ethyl]-3-(cyclopropylmethoxy)-5-(5-methyl-1,3-thiazol-2-yl)benzamide US10202369, Example 6 | US10472354, Example 6
TypeSmall organic molecule
Emp. Form.C22H21ClFN3O2S
Mol. Mass.445.937
SMILESCC(NC(=O)c1cc(OCC2CC2)cc(c1)-c1ncc(C)s1)c1ncc(Cl)cc1F