Reaction Details
TargetP2X purinoceptor 3
LigandBDBM319931
Substrate/Competitorn/a
Meas. Tech.Intracellular Calcium Measurement to Assess Antagonist Activity at Human P2X3 and Human P2X2/3 Receptors
IC50 1.000±n/a nM
Citation Davenport, AJBräuer, NFischer, OMRotgeri, ARottmann, ANeagoe, INagel, JGodinho-Coelho, AKlar, J 1,3-thiazol-2-yl substituted benzamides US Patent US10183937 Publication Date 1/22/2019
 
P2X purinoceptor 3
Name:P2X purinoceptor 3
Type:Protein
Mol. Mass.:44292.02
Organism:Homo sapiens (Human)
Description:P56373
Residue:397
BDBM319931
NameBDBM319931
Synonyms:3-(5-Methyl- 1,3-thiazol-2- yl)-5- (tetrahydro- 2H-pyran-4- ylmethoxy)- N-[(1R)-1-[2- (trifluorometh- yl)pyrimidin- 5- yl]ethyl] benzamide US10202369, Example 98 | US10472354, Example 98
TypeSmall organic molecule
Emp. Form.C24H25F3N4O3S
Mol. Mass.506.541
SMILESC[C@@H](NC(=O)c1cc(OCC2CCOCC2)cc(c1)-c1ncc(C)s1)c1cnc(nc1)C(F)(F)F