Reaction Details
TargetP2X purinoceptor 3
LigandBDBM320173
Substrate/Competitorn/a
Meas. Tech.Intracellular Calcium Measurement to Assess Antagonist Activity at Human P2X3 and Human P2X2/3 Receptors
IC50 5.00±n/a nM
Citation Davenport, AJBräuer, NFischer, OMRotgeri, ARottmann, ANeagoe, INagel, JGodinho-Coelho, AKlar, J 1,3-thiazol-2-yl substituted benzamides US Patent US10183937 Publication Date 1/22/2019
 
P2X purinoceptor 3
Name:P2X purinoceptor 3
Type:Protein
Mol. Mass.:44292.02
Organism:Homo sapiens (Human)
Description:P56373
Residue:397
BDBM320173
NameBDBM320173
Synonyms:US10174016, Example 340 | US10472354, Example 340
TypeSmall organic molecule
Emp. Form.C22H23F3N4O3S
Mol. Mass.480.503
SMILESCC(O)[C@@H](C)Oc1cc(cc(c1)-c1ncc(C)s1)C(=O)N[C@H](C)c1cnc(nc1)C(F)(F)F