Reaction Details
TargetP2X purinoceptor 2
LigandBDBM320016
Substrate/Competitorn/a
Meas. Tech.Intracellular Calcium Measurement to Assess Antagonist Activity at Human P2X3 and Human P2X2/3 Receptors
IC50 398±n/a nM
Citation Davenport, AJBräuer, NFischer, OMRotgeri, ARottmann, ANeagoe, INagel, JGodinho-Coelho, AKlar, J 1,3-thiazol-2-yl substituted benzamides US Patent US10183937 Publication Date 1/22/2019
 
P2X purinoceptor 2
Name:P2X purinoceptor 2
Type:Enzyme Catalytic Domain
Mol. Mass.:51765.18
Organism:Homo sapiens (Human)
Description:PurinergicP2X2/3 0 HUMAN::Q9UBL9
Residue:471
BDBM320016
NameBDBM320016
Synonyms:Trans Isomer 1; 3- {[3-hydroxybutan- 2-yl]oxy}-5-(5- methyl-1,3- thiazol-2-yl)-N- {(1R)-1-[6- (trifluoromethyl) pyridazin-3- yl]ethyl}benzamide US10202369, Example 230 | US10472354, Example 231
TypeSmall organic molecule
Emp. Form.C22H23F3N4O3S
Mol. Mass.480.503
SMILESCC(O)C(C)Oc1cc(cc(c1)-c1ncc(C)s1)C(=O)N[C@H](C)c1ccc(nn1)C(F)(F)F