Reaction Details
TargetP2X purinoceptor 2
LigandBDBM320017
Substrate/Competitorn/a
Meas. Tech.Intracellular Calcium Measurement to Assess Antagonist Activity at Human P2X3 and Human P2X2/3 Receptors
IC50 128±n/a nM
Citation Davenport, AJBräuer, NFischer, OMRotgeri, ARottmann, ANeagoe, INagel, JGodinho-Coelho, AKlar, J 1,3-thiazol-2-yl substituted benzamides US Patent US10183937 Publication Date 1/22/2019
 
P2X purinoceptor 2
Name:P2X purinoceptor 2
Type:Enzyme Catalytic Domain
Mol. Mass.:51765.18
Organism:Homo sapiens (Human)
Description:PurinergicP2X2/3 0 HUMAN::Q9UBL9
Residue:471
BDBM320017
NameBDBM320017
Synonyms:Trans Isomer 1; 3- (5-chloro-1,3- thiazol-2-yl)-5-{[3- hydroxybutan-2- yl]oxy}-N-{(1R)-1- [2-(trifluoromethyl) pyrimidin-5-yl]ethyl} benzamide US10174016, Example 185 US10174016, Example 188 US10472354, Example 188
TypeSmall organic molecule
Emp. Form.C21H20ClF3N4O3S
Mol. Mass.500.922
SMILESCC(O)C(C)Oc1cc(cc(c1)-c1ncc(Cl)s1)C(=O)N[C@H](C)c1cnc(nc1)C(F)(F)F