Reaction Details
TargetP2X purinoceptor 3
LigandBDBM322411
Substrate/Competitorn/a
Meas. Tech.Intracellular Calcium Measurement to Assess Antagonist Activity at Human P2X3 and Human P2X2/3 Receptors
IC50 4.00±n/a nM
Citation Davenport, AJBräuer, NFischer, OMRotgeri, ARottmann, ANeagoe, INagel, JGodinho-Coelho, AKlar, J 1,3-thiazol-2-yl substituted benzamides US Patent US10183937 Publication Date 1/22/2019
 
P2X purinoceptor 3
Name:P2X purinoceptor 3
Type:Protein
Mol. Mass.:44292.02
Organism:Homo sapiens (Human)
Description:P56373
Residue:397
BDBM322411
NameBDBM322411
Synonyms:3-(5-methyl-1,3-thiazol-2-yl)-5-{[1-methyl-2-(trifluoromethyl)piperidin-4-yl]oxy}-N-{(1R)-1-[2-(trifluoromethyl)pyrimidin-5-yl]ethyl}benzamide US10202369, Example 222 | US10472354, Example 223
TypeSmall organic molecule
Emp. Form.C25H25F6N5O2S
Mol. Mass.573.554
SMILESC[C@@H](NC(=O)c1cc(OC2CCN(C)C(C2)C(F)(F)F)cc(c1)-c1ncc(C)s1)c1cnc(nc1)C(F)(F)F