Reaction Details
TargetP2X purinoceptor 3
LigandBDBM320117
Substrate/Competitorn/a
Meas. Tech.Intracellular Calcium Measurement to Assess Antagonist Activity at Human P2X3 and Human P2X2/3 Receptors
IC50 4.00±n/a nM
Citation Davenport, AJBräuer, NFischer, OMRotgeri, ARottmann, ANeagoe, INagel, JGodinho-Coelho, AKlar, J 1,3-thiazol-2-yl substituted benzamides US Patent US10183937 Publication Date 1/22/2019
 
P2X purinoceptor 3
Name:P2X purinoceptor 3
Type:Protein
Mol. Mass.:44292.02
Organism:Homo sapiens (Human)
Description:P56373
Residue:397
BDBM320117
NameBDBM320117
Synonyms:3-(5-ethyl-1,3- thiazol-2-yl)-5- [(2S)- tetrahydrofuran-2- ylmethoxy]-N- {(1R)-1-[2- (trifluoromethyl) pyrimidin-5- yl]ethyl}benzamide US10202369, Example 284 | US10472354, Example 284
TypeSmall organic molecule
Emp. Form.C24H25F3N4O3S
Mol. Mass.506.541
SMILESCCc1cnc(s1)-c1cc(OC[C@@H]2CCCO2)cc(c1)C(=O)N[C@H](C)c1cnc(nc1)C(F)(F)F