Reaction Details
TargetP2X purinoceptor 2
LigandBDBM320144
Substrate/Competitorn/a
Meas. Tech.Intracellular Calcium Measurement to Assess Antagonist Activity at Human P2X3 and Human P2X2/3 Receptors
IC50 35.0±n/a nM
Citation Davenport, AJBräuer, NFischer, OMRotgeri, ARottmann, ANeagoe, INagel, JGodinho-Coelho, AKlar, J 1,3-thiazol-2-yl substituted benzamides US Patent US10183937 Publication Date 1/22/2019
 
P2X purinoceptor 2
Name:P2X purinoceptor 2
Type:Enzyme Catalytic Domain
Mol. Mass.:51765.18
Organism:Homo sapiens (Human)
Description:PurinergicP2X2/3 0 HUMAN::Q9UBL9
Residue:471
BDBM320144
NameBDBM320144
Synonyms:N-[(1R)-1-(6- methylpyridazin-3- yl)ethyl]-3-(5- methyl-1,3- thiazol-2-yl)-5-{[1- (2,2,2- trifluoroethyl) piperidin-4-yl]oxy} benzamide US10202369, Example 311 | US10472354, Example 314
TypeSmall organic molecule
Emp. Form.C25H28F3N5O2S
Mol. Mass.519.582
SMILESC[C@@H](NC(=O)c1cc(OC2CCN(CC(F)(F)F)CC2)cc(c1)-c1ncc(C)s1)c1ccc(C)nn1