Reaction Details
TargetP2X purinoceptor 2
LigandBDBM322546
Substrate/Competitorn/a
Meas. Tech.Intracellular Calcium Measurement to Assess Antagonist Activity at Human P2X3 and Human P2X2/3 Receptors
IC50 310±n/a nM
Citation Davenport, AJBräuer, NFischer, OMRotgeri, ARottmann, ANeagoe, INagel, JGodinho-Coelho, AKlar, J 1,3-thiazol-2-yl substituted benzamides US Patent US10183937 Publication Date 1/22/2019
 
P2X purinoceptor 2
Name:P2X purinoceptor 2
Type:Enzyme Catalytic Domain
Mol. Mass.:51765.18
Organism:Homo sapiens (Human)
Description:PurinergicP2X2/3 0 HUMAN::Q9UBL9
Residue:471
BDBM322546
NameBDBM322546
Synonyms:US10183937, Example 357 | US10202369, Example 357
TypeSmall organic molecule
Emp. Form.C25H27F4N5O2S
Mol. Mass.537.573
SMILESC[C@H](NC(=O)c1cc(OCC2(F)CCCN(C)C2)cc(c1)-c1ncc(C)s1)c1cnc(nc1)C(F)(F)F