Reaction Details
TargetDual specificity mitogen-activated protein kinase kinase 1 [K97R]
LigandBDBM200427
Substrate/Competitorn/a
Meas. Tech.Radioactive Binding Assay
IC50 1.50±n/a nM
Citation Bock, MGMoebitz, HPanigrahi, SKPoddutoori, RSamajdar, S Compounds and compositions as inhibitors of MEK US Patent US9629836 Publication Date 4/25/2017
 
Dual specificity mitogen-activated protein kinase kinase 1 [K97R]
Name:Dual specificity mitogen-activated protein kinase kinase 1 [K97R]
Type:n/a
Mol. Mass.:43467.04
Organism:Homo sapiens (Human)
Description:Biotinylated full length MEK1 with an inactivating K97R ATP binding site mutation.
Residue:393
BDBM200427
NameBDBM200427
Synonyms:US10011599, Example 54 US9629836, 54
TypeSmall organic molecule
Emp. Form.C31H28ClFN6O3
Mol. Mass.587.044
SMILESCc1nc2cnc3cc(F)c(cc3c2n1C1CCN(CC1)C(=O)CO)-c1ccc(Oc2nccc(n2)C2CC2)cc1Cl