Reaction Details
TargetSerine/threonine-protein kinase Chk1
LigandBDBM323156
Substrate/Competitorn/a
Meas. Tech.Kinase Inhibition Asssay
IC50 0.520±n/a nM
Citation Boyle, RGBoyce, RJ Pharmaceutically active pyrazine derivatives US Patent US9630931 Publication Date 4/25/2017
 
Serine/threonine-protein kinase Chk1
Name:Serine/threonine-protein kinase Chk1
Type:Enzyme Catalytic Domain
Mol. Mass.:54443.02
Organism:Homo sapiens (Human)
Description:gi_166295192
Residue:476
BDBM323156
NameBDBM323156
Synonyms:US9630931, Example 18
TypeSmall organic molecule
Emp. Form.C22H28ClN7O3
Mol. Mass.473.956
SMILESCOc1cc(CCN[C@@H](C)CN2CCOCC2)c(Cl)cc1NC(=O)Nc1cnc(cn1)C#N