Reaction Details
TargetDual specificity protein kinase TTK
LigandBDBM230912
Substrate/Competitorn/a
Meas. Tech.Measurement of Inhibition of MPS1 Kinase
IC50 2.00±n/a nM
Citation Hoelder, SBlagg, JCheung, KJAtrash, BSheldrake, P Pharmacologically active compounds US Patent US10188642 Publication Date 1/29/2019
 
Dual specificity protein kinase TTK
Name:Dual specificity protein kinase TTK
Type:Protein
Mol. Mass.:97086.79
Organism:Homo sapiens (Human)
Description:P33981
Residue:857
BDBM230912
NameBDBM230912
Synonyms:US10188642, Example 38 | US9334286, 38
TypeSmall organic molecule
Emp. Form.C27H28N6O2
Mol. Mass.468.5502
SMILESCOc1cc(ccc1Nc1cc2cc(ccc2cn1)-c1cnn(CC(C)O)c1)-c1cnc(C)n1C