Reaction Details
TargetDual specificity protein kinase TTK
LigandBDBM230924
Substrate/Competitorn/a
Meas. Tech.Measurement of Inhibition of MPS1 Kinase
IC50 2.00±n/a nM
Citation Hoelder, SBlagg, JCheung, KJAtrash, BSheldrake, P Pharmacologically active compounds US Patent US10188642 Publication Date 1/29/2019
 
Dual specificity protein kinase TTK
Name:Dual specificity protein kinase TTK
Type:Protein
Mol. Mass.:97086.79
Organism:Homo sapiens (Human)
Description:P33981
Residue:857
BDBM230924
NameBDBM230924
Synonyms:US10188642, Example 50 | US9334286, 50
TypeSmall organic molecule
Emp. Form.C28H29FN6O2
Mol. Mass.500.5673
SMILESCOc1c(Nc2cc3cc(ccc3cn2)-c2cnn(CC(C)(C)O)c2)ccc(-c2cnc(C)n2C)c1F