Reaction Details
TargetDual specificity protein kinase TTK
LigandBDBM230937
Substrate/Competitorn/a
Meas. Tech.Measurement of Inhibition of MPS1 Kinase
IC50 1.000±n/a nM
Citation Hoelder, SBlagg, JCheung, KJAtrash, BSheldrake, P Pharmacologically active compounds US Patent US10188642 Publication Date 1/29/2019
 
Dual specificity protein kinase TTK
Name:Dual specificity protein kinase TTK
Type:Protein
Mol. Mass.:97086.79
Organism:Homo sapiens (Human)
Description:P33981
Residue:857
BDBM230937
NameBDBM230937
Synonyms:US10188642, Example 63 | US9334286, 63
TypeSmall organic molecule
Emp. Form.C29H32N6O3
Mol. Mass.512.6028
SMILESCOCc1ncc(-c2ccc(Nc3cc4cc(ccc4cn3)-c3cnn(CC(C)(C)O)c3)c(OC)c2)n1C