Reaction Details
TargetDual specificity protein kinase TTK
LigandBDBM230977
Substrate/Competitorn/a
Meas. Tech.Measurement of Inhibition of MPS1 Kinase
IC50 2.00±n/a nM
Citation Hoelder, SBlagg, JCheung, KJAtrash, BSheldrake, P Pharmacologically active compounds US Patent US10188642 Publication Date 1/29/2019
 
Dual specificity protein kinase TTK
Name:Dual specificity protein kinase TTK
Type:Protein
Mol. Mass.:97086.79
Organism:Homo sapiens (Human)
Description:P33981
Residue:857
BDBM230977
NameBDBM230977
Synonyms:US10188642, Example 104 | US9334286, 104
TypeSmall organic molecule
Emp. Form.C27H30N6O4
Mol. Mass.502.5649
SMILESCOC1CN(C1)C(=O)c1ccc(Nc2cc3nc(ccc3cn2)-c2cnn(CC(C)(C)O)c2)c(OC)c1