Reaction Details
TargetDual specificity protein kinase TTK
LigandBDBM230978
Substrate/Competitorn/a
Meas. Tech.Measurement of Inhibition of MPS1 Kinase
IC50 1.000±n/a nM
Citation Hoelder, SBlagg, JCheung, KJAtrash, BSheldrake, P Pharmacologically active compounds US Patent US10188642 Publication Date 1/29/2019
 
Dual specificity protein kinase TTK
Name:Dual specificity protein kinase TTK
Type:Protein
Mol. Mass.:97086.79
Organism:Homo sapiens (Human)
Description:P33981
Residue:857
BDBM230978
NameBDBM230978
Synonyms:US10188642, Example 105 | US9334286, 105
TypeSmall organic molecule
Emp. Form.C25H26N8O2
Mol. Mass.470.5263
SMILESCOc1cc(ccc1Nc1cc2nc(ccc2cn1)-c1cnn(CC(C)(C)O)c1)-c1nncn1C