Reaction Details
TargetRAF proto-oncogene serine/threonine-protein kinase [306-648,Y340D,Y341D]
LigandBDBM186828
Substrate/Competitorn/a
Meas. Tech.Raf IC50 Assay
Temperature298.15±n/a K
IC50 2700±n/a nM
Commentsextracted
Citation Zhou, CZhang, G Fused tricyclic urea compounds as Raf kinase and/or Raf kinase dimer inhibitors US Patent US9670203 Publication Date 6/6/2017
 
RAF proto-oncogene serine/threonine-protein kinase [306-648,Y340D,Y341D]
Name:RAF proto-oncogene serine/threonine-protein kinase [306-648,Y340D,Y341D]
Type:n/a
Mol. Mass.:38958.87
Organism:Homo sapiens (Human)
Description:PV3805, from Invitrogen
Residue:343
BDBM186828
NameBDBM186828
Synonyms:US9670203, Compound 1.20
TypeSmall organic molecule
Emp. Form.C25H18F4N4O4
Mol. Mass.514.4284
SMILESFc1cc(ccc1NC(=O)N[C@@H]1[C@H]2Oc3ccc(Oc4ccnc5NC(=O)CCc45)cc3[C@@H]12)C(F)(F)F