Reaction Details
TargetRAF proto-oncogene serine/threonine-protein kinase [306-648,Y340D,Y341D]
LigandBDBM186830
Substrate/Competitorn/a
Meas. Tech.Raf IC50 Assay
Temperature298.15±n/a K
IC50 180±n/a nM
Commentsextracted
Citation Zhou, CZhang, G Fused tricyclic urea compounds as Raf kinase and/or Raf kinase dimer inhibitors US Patent US9670203 Publication Date 6/6/2017
 
RAF proto-oncogene serine/threonine-protein kinase [306-648,Y340D,Y341D]
Name:RAF proto-oncogene serine/threonine-protein kinase [306-648,Y340D,Y341D]
Type:n/a
Mol. Mass.:38958.87
Organism:Homo sapiens (Human)
Description:PV3805, from Invitrogen
Residue:343
BDBM186830
NameBDBM186830
Synonyms:US9670203, Compound 1.22 | US9670203, Compound 1.57
TypeSmall organic molecule
Emp. Form.C24H19FN4O4
Mol. Mass.446.4305
SMILESFc1cccc(NC(=O)N[C@@H]2[C@H]3Oc4ccc(Oc5ccnc6NC(=O)CCc56)cc4[C@@H]23)c1