Reaction Details
TargetSerine/threonine-protein kinase B-raf [416-766,V600E]
LigandBDBM186832
Substrate/Competitorn/a
Meas. Tech.Raf IC50 Assay
Temperature298.15±n/a K
IC50 1500±n/a nM
Commentsextracted
Citation Zhou, CZhang, G Fused tricyclic urea compounds as Raf kinase and/or Raf kinase dimer inhibitors US Patent US9670203 Publication Date 6/6/2017
 
Serine/threonine-protein kinase B-raf [416-766,V600E]
Name:Serine/threonine-protein kinase B-raf [416-766,V600E]
Type:n/a
Mol. Mass.:39690.71
Organism:Homo sapiens (Human)
Description:PV3849, from Invitrogen
Residue:351
BDBM186832
NameBDBM186832
Synonyms:US9670203, Compound 1.24
TypeSmall organic molecule
Emp. Form.C25H21FN4O4
Mol. Mass.460.457
SMILESCc1cc(NC(=O)N[C@@H]2[C@H]3Oc4ccc(Oc5ccnc6NC(=O)CCc56)cc4[C@@H]23)ccc1F