Reaction Details
TargetRAF proto-oncogene serine/threonine-protein kinase [306-648,Y340D,Y341D]
LigandBDBM186323
Substrate/Competitorn/a
Meas. Tech.Raf IC50 Assay
Temperature298.15±n/a K
IC50 1400±n/a nM
Commentsextracted
Citation Zhou, CZhang, G Fused tricyclic urea compounds as Raf kinase and/or Raf kinase dimer inhibitors US Patent US9670203 Publication Date 6/6/2017
 
RAF proto-oncogene serine/threonine-protein kinase [306-648,Y340D,Y341D]
Name:RAF proto-oncogene serine/threonine-protein kinase [306-648,Y340D,Y341D]
Type:n/a
Mol. Mass.:38958.87
Organism:Homo sapiens (Human)
Description:PV3805, from Invitrogen
Residue:343
BDBM186323
NameBDBM186323
Synonyms:US9670203, Compound 1.1 1-((1S,1aS,6bS)-5-((7-oxo-5,6,7,8-tetrahydro-1,8-naphthyridin-4-yl) oxy)-1a,6b-dihydro-1H-cyclopropa[b]benzofuran-1-yl)-3-(3-(trifluoromethyl) phenyl)urea US9670203, Compound 1.55
TypeSmall organic molecule
Emp. Form.C25H19F3N4O4
Mol. Mass.496.438
SMILESFC(F)(F)c1cccc(NC(=O)N[C@@H]2[C@H]3Oc4ccc(Oc5ccnc6NC(=O)CCc56)cc4[C@@H]23)c1