Reaction Details
TargetSerine/threonine-protein kinase B-raf [416-766,V600E]
LigandBDBM190878
Substrate/Competitorn/a
Meas. Tech.Raf IC50 Assay
Temperature298.15±n/a K
IC50 2200±n/a nM
Commentsextracted
Citation Zhou, CZhang, G Fused tricyclic urea compounds as Raf kinase and/or Raf kinase dimer inhibitors US Patent US9670203 Publication Date 6/6/2017
 
Serine/threonine-protein kinase B-raf [416-766,V600E]
Name:Serine/threonine-protein kinase B-raf [416-766,V600E]
Type:n/a
Mol. Mass.:39690.71
Organism:Homo sapiens (Human)
Description:PV3849, from Invitrogen
Residue:351
BDBM190878
NameBDBM190878
Synonyms:US9670203, Compound 1.75 1-(2-methoxypyridin-4-yl)-3-((1S,1aS,6bS)-5-((7-oxo-5,6,7,8-tetrahydro-1,8-naphthyridin-4-yl)oxy)-1a,6b-dihydro-1H-cyclopropa[b]benzofuran-1-yl)urea
TypeSmall organic molecule
Emp. Form.C24H21N5O5
Mol. Mass.459.454
SMILESCOc1cc(NC(=O)N[C@@H]2[C@H]3Oc4ccc(Oc5ccnc6NC(=O)CCc56)cc4[C@@H]23)ccn1