Reaction Details
TargetRAF proto-oncogene serine/threonine-protein kinase [306-648,Y340D,Y341D]
LigandBDBM191345
Substrate/Competitorn/a
Meas. Tech.Raf IC50 Assay
Temperature298.15±n/a K
IC50 3000±n/a nM
Commentsextracted
Citation Zhou, CZhang, G Fused tricyclic urea compounds as Raf kinase and/or Raf kinase dimer inhibitors US Patent US9670203 Publication Date 6/6/2017
 
RAF proto-oncogene serine/threonine-protein kinase [306-648,Y340D,Y341D]
Name:RAF proto-oncogene serine/threonine-protein kinase [306-648,Y340D,Y341D]
Type:n/a
Mol. Mass.:38958.87
Organism:Homo sapiens (Human)
Description:PV3805, from Invitrogen
Residue:343
BDBM191345
NameBDBM191345
Synonyms:US9670203, Compound 2.8
TypeSmall organic molecule
Emp. Form.C23H17F3N4O4
Mol. Mass.470.4007
SMILESCNC(=O)c1cc(Oc2ccc3O[C@@H]4[C@@H](NC(=O)Nc5cc(F)c(F)cc5F)[C@@H]4c3c2)ccn1