Reaction Details
TargetTyrosine-protein kinase JAK1
LigandBDBM324513
Substrate/Competitorn/a
Meas. Tech.JAK Enzyme Assays
Ki 0.400±n/a nM
Citation Cheng, YHua, RKellar, TLi, WGibbons, PZak, ME Therapeutic compounds, compositions and methods of use thereof US Patent US10189836 Publication Date 1/29/2019
 
Tyrosine-protein kinase JAK1
Name:Tyrosine-protein kinase JAK1
Type:Protein
Mol. Mass.:133293.73
Organism:Homo sapiens (Human)
Description:P23458
Residue:1154
BDBM324513
NameBDBM324513
Synonyms:1-[4-(thietan-3- yl)piperazin-1-yl]-2-[4-[4 [[8-[8-[3- (trifluoromethyl)cyclo- butanecarbonyl]-3,8- diazabicyclo[3.2.1]octan- 3-yl]-[1,2,4]triazolo[1,5-a] pyridin-2- yl]amino]pyrazol-1- yl]ethanone | US10189836, Example 82
TypeSmall organic molecule
Emp. Form.C30H37F3N10O2S
Mol. Mass.658.741
SMILESFC(F)(F)[C@@H]1C[C@@H](C1)C(=O)N1C2CCC1CN(C2)c1cccn2nc(Nc3cnn(CC(=O)N4CCN(CC4)C4CSC4)c3)nc12