Reaction Details
TargetTyrosine-protein kinase JAK2
LigandBDBM324519
Substrate/Competitorn/a
Meas. Tech.JAK Enzyme Assays
Ki 0.300±n/a nM
Citation Cheng, YHua, RKellar, TLi, WGibbons, PZak, ME Therapeutic compounds, compositions and methods of use thereof US Patent US10189836 Publication Date 1/29/2019
 
Tyrosine-protein kinase JAK2
Name:Tyrosine-protein kinase JAK2
Type:Protein
Mol. Mass.:130684.68
Organism:Homo sapiens (Human)
Description:O60674
Residue:1132
BDBM324519
NameBDBM324519
Synonyms:2-[4-[[8-[8-(3- chlorophenyl)sulfonyl-3,8- diazabicyclo[3.2.1]octan- 3-yl]-[1,2,4]triazolo[1,5-a] pyridin-2- yl]amino]pyrazol-1-yl]-1 - (4-methylpiperazin-1- yl)ethanone | US10189836, Example 88
TypeSmall organic molecule
Emp. Form.C28H33ClN10O3S
Mol. Mass.625.145
SMILESCN1CCN(CC1)C(=O)Cn1cc(Nc2nc3c(cccn3n2)N2CC3CCC(C2)N3S(=O)(=O)c2cccc(Cl)c2)cn1