Reaction Details
TargetTyrosine-protein kinase JAK2
LigandBDBM324559
Substrate/Competitorn/a
Meas. Tech.JAK Enzyme Assays
Ki 0.300±n/a nM
Citation Cheng, YHua, RKellar, TLi, WGibbons, PZak, ME Therapeutic compounds, compositions and methods of use thereof US Patent US10189836 Publication Date 1/29/2019
 
Tyrosine-protein kinase JAK2
Name:Tyrosine-protein kinase JAK2
Type:Protein
Mol. Mass.:130684.68
Organism:Homo sapiens (Human)
Description:O60674
Residue:1132
BDBM324559
NameBDBM324559
Synonyms:1-(4-methylpiperazin-1- yl)-2-[4-[[8-[9-[3- (trifluoromethyl)azetidine- 1-carbonyl]-3,9- diazabicyclo[3.3.1]nonan- 3-yl]-[1,2,4]triazolo[1,5-a] pyridin-2- yl]amino]pyrazol-1- yl]ethanone | US10189836, Example 122
TypeSmall organic molecule
Emp. Form.C28H36F3N11O2
Mol. Mass.615.6531
SMILESCN1CCN(CC1)C(=O)Cn1cc(Nc2nc3c(cccn3n2)N2CC3CCCC(C2)N3C(=O)N2CC(C2)C(F)(F)F)cn1