Reaction Details
TargetTyrosine-protein kinase JAK1
LigandBDBM324569
Substrate/Competitorn/a
Meas. Tech.JAK Enzyme Assays
Ki 0.400±n/a nM
Citation Cheng, YHua, RKellar, TLi, WGibbons, PZak, ME Therapeutic compounds, compositions and methods of use thereof US Patent US10189836 Publication Date 1/29/2019
 
Tyrosine-protein kinase JAK1
Name:Tyrosine-protein kinase JAK1
Type:Protein
Mol. Mass.:133293.73
Organism:Homo sapiens (Human)
Description:P23458
Residue:1154
BDBM324569
NameBDBM324569
Synonyms:1-(4-methylpiperazin-1- yl)-2-[4-[[8-[8-(2- methylsulfanylphenyl) sulfonyl-3,8- diazabicyclo[3.2.1]octan- 3-yl]-[1,2,4]triazolo[1,5-a] pyridin-2- yl]amino]pyrazol-1- yl]ethanone | US10189836, Example 132
TypeSmall organic molecule
Emp. Form.C29H36N10O3S2
Mol. Mass.636.791
SMILESCSc1ccccc1S(=O)(=O)N1C2CCC1CN(C2)c1cccn2nc(Nc3cnn(CC(=O)N4CCN(C)CC4)c3)nc12