Reaction Details
TargetTyrosine-protein kinase JAK2
LigandBDBM324590
Substrate/Competitorn/a
Meas. Tech.JAK Enzyme Assays
Ki 0.300±n/a nM
Citation Cheng, YHua, RKellar, TLi, WGibbons, PZak, ME Therapeutic compounds, compositions and methods of use thereof US Patent US10189836 Publication Date 1/29/2019
 
Tyrosine-protein kinase JAK2
Name:Tyrosine-protein kinase JAK2
Type:Protein
Mol. Mass.:130684.68
Organism:Homo sapiens (Human)
Description:O60674
Residue:1132
BDBM324590
NameBDBM324590
Synonyms:1-[3-[2-[[1-[2-(4- cyclohexylpiperazin-1-yl)- 2-oxo-ethyl]pyrazol-4- yl]amino]- [1,2,4]triazolo[1,5-a] pyridin-8-yl]-3,8- diazabicyclo[3.2.1]octan- 8-yl]-4,4,4-trifluoro-butan- 1-one | US10189836, Example 153
TypeSmall organic molecule
Emp. Form.C31H41F3N10O2
Mol. Mass.642.7182
SMILESFC(F)(F)CCC(=O)N1C2CCC1CN(C2)c1cccn2nc(Nc3cnn(CC(=O)N4CCN(CC4)C4CCCCC4)c3)nc12