Reaction Details
TargetTyrosine-protein kinase JAK1
LigandBDBM324607
Substrate/Competitorn/a
Meas. Tech.JAK Enzyme Assays
Ki 0.300±n/a nM
Citation Cheng, YHua, RKellar, TLi, WGibbons, PZak, ME Therapeutic compounds, compositions and methods of use thereof US Patent US10189836 Publication Date 1/29/2019
 
Tyrosine-protein kinase JAK1
Name:Tyrosine-protein kinase JAK1
Type:Protein
Mol. Mass.:133293.73
Organism:Homo sapiens (Human)
Description:P23458
Residue:1154
BDBM324607
NameBDBM324607
Synonyms:2-[4-[[8-[8-(3- fluoroazetidine-1- carbonyl)-3,8- diazabicyclo[3.2.1]octan- 3-yl]-[1,2,4]triazolo[1,5-a] pyridin-2- yl]amino]pyrazol-1-yl]-1- (4-methylpiperazin-1- yl)ethanone | US10189836, Example 170
TypeSmall organic molecule
Emp. Form.C26H34FN11O2
Mol. Mass.551.6191
SMILESCN1CCN(CC1)C(=O)Cn1cc(Nc2nc3c(cccn3n2)N2CC3CCC(C2)N3C(=O)N2CC(F)C2)cn1