Reaction Details
TargetTyrosine-protein kinase JAK1
LigandBDBM324622
Substrate/Competitorn/a
Meas. Tech.JAK Enzyme Assays
Ki 0.500±n/a nM
Citation Cheng, YHua, RKellar, TLi, WGibbons, PZak, ME Therapeutic compounds, compositions and methods of use thereof US Patent US10189836 Publication Date 1/29/2019
 
Tyrosine-protein kinase JAK1
Name:Tyrosine-protein kinase JAK1
Type:Protein
Mol. Mass.:133293.73
Organism:Homo sapiens (Human)
Description:P23458
Residue:1154
BDBM324622
NameBDBM324622
Synonyms:4-[3-[2-[[1-[2-(4- methylpiperazin-1-yl)-2- oxo-ethyl]pyrazol-4- yl]amino]- [1,2,4]triazolo[1,5-a] pyridin-8-yl]-3,8- diazabicyclo[3.2.1]octane- carbonyl]benzonitrile | US10189836, Example 185
TypeSmall organic molecule
Emp. Form.C30H33N11O2
Mol. Mass.579.6555
SMILESCN1CCN(CC1)C(=O)Cn1cc(Nc2nc3c(cccn3n2)N2CC3CCC(C2)N3C(=O)c2ccc(cc2)C#N)cn1