Reaction Details
TargetDipeptidyl peptidase 4
LigandBDBM11560
Substrate/CompetitorBDBM11561
Meas. Tech.Fluorogenic Assay
pH7.5±n/a
Temperature295.15±n/a K
IC50 10000±n/a nM
Citation Peters, JUWeber, SKritter, SWeiss, PWallier, ABoehringer, MHennig, MKuhn, BLoeffler, BM Aminomethylpyrimidines as novel DPP-IV inhibitors: a 10(5)-fold activity increase by optimization of aromatic substituents. Bioorg Med Chem Lett14:1491-3 (2004) 
 
Dipeptidyl peptidase 4
Name:Dipeptidyl peptidase 4
Type:Enzyme
Mol. Mass.:88271.01
Organism:Homo sapiens (Human)
Description:P27487
Residue:766
BDBM11560
BDBM11561
NameBDBM11560
Synonyms:5-(aminomethyl)-6-(2H-1,3-benzodioxol-5-yl)-2-phenylpyrimidin-4-amine CHEMBL37980
TypeSmall organic molecule
Emp. Form.C18H16N4O2
Mol. Mass.320.3452
SMILESNCc1c(N)nc(nc1-c1ccc2OCOc2c1)-c1ccccc1