Reaction Details
TargetDipeptidyl peptidase 4
LigandBDBM11563
Substrate/CompetitorBDBM11561
Meas. Tech.Fluorogenic Assay
pH7.5±n/a
Temperature295.15±n/a K
IC50 1500±n/a nM
Citation Peters, JUWeber, SKritter, SWeiss, PWallier, ABoehringer, MHennig, MKuhn, BLoeffler, BM Aminomethylpyrimidines as novel DPP-IV inhibitors: a 10(5)-fold activity increase by optimization of aromatic substituents. Bioorg Med Chem Lett14:1491-3 (2004) 
 
Dipeptidyl peptidase 4
Name:Dipeptidyl peptidase 4
Type:Enzyme
Mol. Mass.:88271.01
Organism:Homo sapiens (Human)
Description:P27487
Residue:766
BDBM11563
BDBM11561
NameBDBM11563
Synonyms:1b-ortho-Me Aminomethylpyrimidine 1ba
TypeSmall organic molecule
Emp. Form.C18H18N4
Mol. Mass.290.3623
SMILESCc1ccccc1-c1nc(nc(N)c1CN)-c1ccccc1