Reaction Details
TargetDipeptidyl peptidase 4
LigandBDBM11567
Substrate/CompetitorBDBM11561
Meas. Tech.Fluorogenic Assay
pH7.5±n/a
Temperature295.15±n/a K
IC50 31000±n/a nM
Citation Peters, JUWeber, SKritter, SWeiss, PWallier, ABoehringer, MHennig, MKuhn, BLoeffler, BM Aminomethylpyrimidines as novel DPP-IV inhibitors: a 10(5)-fold activity increase by optimization of aromatic substituents. Bioorg Med Chem Lett14:1491-3 (2004) 
 
Dipeptidyl peptidase 4
Name:Dipeptidyl peptidase 4
Type:Enzyme
Mol. Mass.:88271.01
Organism:Homo sapiens (Human)
Description:P27487
Residue:766
BDBM11567
BDBM11561
NameBDBM11567
Synonyms:1b-meta-Cl Aminomethylpyrimidine 1be
TypeSmall organic molecule
Emp. Form.C17H15ClN4
Mol. Mass.310.781
SMILESNCc1c(N)nc(nc1-c1cccc(Cl)c1)-c1ccccc1