Reaction Details
TargetDipeptidyl peptidase 4
LigandBDBM11575
Substrate/CompetitorBDBM11561
Meas. Tech.Fluorogenic Assay
pH7.5±n/a
Temperature295.15±n/a K
IC50 14000±n/a nM
Citation Peters, JUWeber, SKritter, SWeiss, PWallier, ABoehringer, MHennig, MKuhn, BLoeffler, BM Aminomethylpyrimidines as novel DPP-IV inhibitors: a 10(5)-fold activity increase by optimization of aromatic substituents. Bioorg Med Chem Lett14:1491-3 (2004) 
 
Dipeptidyl peptidase 4
Name:Dipeptidyl peptidase 4
Type:Enzyme
Mol. Mass.:88271.01
Organism:Homo sapiens (Human)
Description:P27487
Residue:766
BDBM11575
BDBM11561
NameBDBM11575
Synonyms:1b-ortho-CF3 Aminomethylpyrimidine 1bm
TypeSmall organic molecule
Emp. Form.C18H15F3N4
Mol. Mass.344.3337
SMILESNCc1c(N)nc(nc1-c1ccccc1C(F)(F)F)-c1ccccc1