Reaction Details
TargetDipeptidyl peptidase 4
LigandBDBM11576
Substrate/CompetitorBDBM11561
Meas. Tech.Fluorogenic Assay
IC50 170000±n/a nM
Citation Peters, JUWeber, SKritter, SWeiss, PWallier, ABoehringer, MHennig, MKuhn, BLoeffler, BM Aminomethylpyrimidines as novel DPP-IV inhibitors: a 10(5)-fold activity increase by optimization of aromatic substituents. Bioorg Med Chem Lett14:1491-3 (2004) 
 
Dipeptidyl peptidase 4
Name:Dipeptidyl peptidase 4
Type:Enzyme
Mol. Mass.:88271.01
Organism:Homo sapiens (Human)
Description:P27487
Residue:766
BDBM11576
BDBM11561
NameBDBM11576
Synonyms:1b-meta-CF3 Aminomethylpyrimidine 1bn
TypeSmall organic molecule
Emp. Form.C18H15F3N4
Mol. Mass.344.3337
SMILESNCc1c(N)nc(nc1-c1cccc(c1)C(F)(F)F)-c1ccccc1