Reaction Details
TargetDipeptidyl peptidase 4
LigandBDBM11582
Substrate/CompetitorBDBM11561
Meas. Tech.Fluorogenic Assay
IC50 240±n/a nM
Citation Peters, JUWeber, SKritter, SWeiss, PWallier, ABoehringer, MHennig, MKuhn, BLoeffler, BM Aminomethylpyrimidines as novel DPP-IV inhibitors: a 10(5)-fold activity increase by optimization of aromatic substituents. Bioorg Med Chem Lett14:1491-3 (2004) 
 
Dipeptidyl peptidase 4
Name:Dipeptidyl peptidase 4
Type:Enzyme
Mol. Mass.:88271.01
Organism:Homo sapiens (Human)
Description:P27487
Residue:766
BDBM11582
BDBM11561
NameBDBM11582
Synonyms:1c-meta-Cl Aminomethylpyrimidine 1cd
TypeSmall organic molecule
Emp. Form.C17H13Cl3N4
Mol. Mass.379.671
SMILESNCc1c(N)nc(nc1-c1ccc(Cl)cc1Cl)-c1cccc(Cl)c1